Kidney Dialysis Centers
type: Class
subclass of: 6X6xJ7TuSFmlAW6Yr-JH6w
definition: This U.S. industry comprises establishments with medical staff primarily engaged in providing outpatient kidney or renal dialysis services.