Aluminum Foundries (except Die-Casting)
type: Class
subclass of: oJnwpIpOTpS95nvUdSwAKA
definition: This U.S. industry comprises establishments primarily engaged in pouring molten aluminum into molds to manufacture aluminum castings (except nonferrous die-castings). Establishments in this industry purchase aluminum made in other establishments.