Coating, Engraving, Heat Treating, and Allied Activities
type: Class
subclass of: iW9gvN2RSHGv9bwou2 FDA
definition: This industry comprises establishments primarily engaged in one or more of the following: (1) heat treating metals and metal products; (2) enameling, lacquering, and varnishing metals and metal products; (3) hot dip galvanizing metals and metal products; (4) engraving, chasing, or etching metals and metal products (except jewelry; personal goods carried on or about the person, such as compacts and cigarette cases; precious metal products (except precious plated flatware and other plated ware); and printing plates); (5) powder coating metals and metal products; (6) electroplating, plating, anodizing, coloring, and finishing metals and metal products; and (7) providing other metal surfacing services for the trade. Establishments in this industry coat, engrave, and heat treat metals and metal formed products fabricated elsewhere. Included in this industry are establishments that perform these processes on other materials, such as plastics, in addition to metals.