All Other Converted Paper Product Manufacturing
type: Class
subclass of: A4LbRW8qSeOadwyg-otSwQ
definition: This U.S. industry comprises establishments primarily engaged in converting paper or paperboard into products (except containers, bags, coated and treated paper, stationery products, and sanitary paper products) or converting pulp into pulp products, such as egg cartons, food trays, and other food containers from molded pulp.
example: Crepe paper made from purchased paper
example: Die-cut paper products (except for office use) made from purchased paper or paperboard
example: Molded pulp products (e.g., egg cartons, food containers, food trays) manufacturing
example: Paper novelties made from purchased paper