Pesticide and Other Agricultural Chemical Manufacturing
type: Class
subclass of: qu8KWP8hTSqHrAWDamtHIg
definition: This industry comprises establishments primarily engaged in the formulation and preparation of agricultural and household pest control chemicals (except fertilizers).