Marketing Consulting Services
type: Class
subclass of: n hXChI-SfOC55gHGN7KqA
definition: This U.S. industry comprises establishments primarily engaged in providing operating advice and assistance to businesses and other organizations on marketing issues, such as developing marketing objectives and policies, sales forecasting, new product developing and pricing, licensing and franchise planning, and marketing planning and strategy.