Urban Transit Systems
type: Class
subclass of: aJZF5F0hSQugkx6lQ5ELFQ
definition: This industry comprises establishments primarily engaged in operating local and suburban passenger transit systems over regular routes and on regular schedules within a metropolitan area and its adjacent nonurban areas. Such transportation systems involve the use of one or more modes of transport including light rail, commuter rail, subways, and streetcars, as well as buses and other motor vehicles.