Services for the Elderly and Persons with Disabilities
type: Class
subclass of: ZpW1OvEUQR6QhdV2MYdQJw
definition: This industry comprises establishments primarily engaged in providing nonresidential social assistance services to improve the quality of life for the elderly or persons with intellectual and/or developmental disabilities. These establishments provide for the welfare of these individuals in such areas as day care, non-medical home care or homemaker services, social activities, group support, and companionship.