Facilities Support Services
type: Class
subclass of: 9OG4cvlYR7OivuWaJgh3CA
definition: This industry comprises establishments primarily engaged in providing operating staff to perform a combination of support services within a client's facilities. Establishments in this industry typically provide a combination of services, such as janitorial, maintenance, trash disposal, guard and security, mail routing, reception, laundry, and related services to support operations within facilities. These establishments provide operating staff to carry out these support activities, but are not involved with or responsible for the core business or activities of the client. Establishments providing facilities (except computer and/or data processing) operation support services and establishments providing private jail services or operating correctional facilities (i.e., jails) on a contract or fee basis are included in this industry.