Other Converted Paper Product Manufacturing
type: Class
subclass of: tQlht4ETRKrwll0G13vfw
definition: This industry comprises establishments primarily engaged in (1) converting paper and paperboard into products (except containers, bags, coated and treated paper and paperboard, and stationery products) or (2) converting pulp into pulp products, such as disposable diapers, or molded pulp egg cartons, food trays, and dishes. Processes used include laminating or lining purchased paper or paperboard.
example: Crepe paper made from purchased paper
example: Die-cut paper products (except for office use) made from purchased paper or paperboard
example: Molded pulp products (e.g., egg cartons, food containers, food trays) manufacturing
example: Paper novelties made from purchased paper
example: Sanitary products made from purchased sanitary paper stock