Chocolate and Confectionery Manufacturing from Cacao Beans
type: Class
subclass of: 7zjy747tRHOiMTRBODSXqA
definition: This U.S. industry comprises establishments primarily engaged in shelling, roasting, and grinding cacao beans and making chocolate cacao products and chocolate confectioneries.