Other Metal Valve and Pipe Fitting Manufacturing
type: Class
subclass of: J5TrhNp2TP-pHSl3EP7OwA
definition: This U.S. industry comprises establishments primarily engaged in manufacturing metal valves (except industrial valves, fluid power valves, fluid power hose fittings, and plumbing fixture fittings and trim).
example: Aerosol valves manufacturing
example: Firefighting nozzles manufacturing
example: Lawn hose nozzles manufacturing
example: Lawn sprinklers manufacturing
example: Metal hose couplings (except fluid power) manufacturing
example: Metal pipe flanges and flange unions manufacturing
example: Plumbing and heating inline valves (e.g., check, cutoff, stop) manufacturing
example: Water traps manufacturing