Exam Preparation and Tutoring
type: Class
subclass of: ZPOZN-AIQOG6rXrpt2o7mA
definition: This U.S. industry comprises establishments primarily engaged in offering preparation for standardized examinations and/or academic tutoring services.
example: Academic tutoring services
example: College board preparation centers
example: Learning centers offering remedial courses
example: Professional examination review instruction