All Other Pipeline Transportation
type: Class
subclass of: rCYGyonUSDWKUFsIJzZAfA
definition: This industry comprises establishments primarily engaged in the pipeline transportation of products (except crude oil, natural gas, and refined petroleum products).