Engine, Turbine, and Power Transmission Equipment Manufacturing
type: Class
subclass of: 3UQGpx1TwiBehojbDEo6w
definition: This industry comprises establishments primarily engaged in manufacturing turbines, power transmission equipment, and internal combustion engines (except automotive gasoline and aircraft).
example: Clutches and brakes (except electromagnetic industrial controls, motor vehicle) manufacturing
example: Diesel and semidiesel engines manufacturing
example: Electric outboard motors manufacturing
example: Internal combustion engines for hybrid drive systems (except automotive) manufacturing
example: Plain bearings (except internal combustion engine) manufacturing
example: Plain bushings (except internal combustion engine) manufacturing
example: Power transmission pulleys manufacturing
example: Speed changers (i.e., power transmission equipment) manufacturing
example: Speed reducers (i.e., power transmission equipment) manufacturing
example: Turbine generator set units manufacturing
example: Universal joints (except aircraft, motor vehicle) manufacturing