Machinery, Equipment, and Supplies Merchant Wholesalers
type: Class
subclass of: R4pYCvaJ8nADRG8NCwgCoa
definition: This industry group comprises establishments primarily engaged in the merchant wholesale distribution of construction, mining, farm, garden, industrial, service establishment, and transportation machinery, equipment, and supplies.