General Rental Centers
type: Class
subclass of: dClxhryRxiooDH8mF-d-Q
definition: This industry comprises establishments primarily engaged in renting a range of consumer, commercial, and industrial equipment. Establishments in this industry typically operate from conveniently located facilities where they maintain inventories of goods and equipment that they rent for short periods of time. The type of equipment that establishments in this industry provide often includes, but is not limited to: audio visual equipment, contractors' and builders' tools and equipment, home repair tools, lawn and garden equipment, moving equipment and supplies, and party and banquet equipment and supplies.