Mineral Wool Manufacturing
type: Class
subclass of: JhRFfbpGQvibW3Os07qUcQ
definition: This U.S. industry comprises establishments primarily engaged in manufacturing mineral wool and mineral wool (i.e., fiberglass) insulation products made of such siliceous materials as rock, slag, and glass or combinations thereof.