Offices of Physicians
type: Class
subclass of: ki7xjsIzQlKFF5W7A76VMA
definition: This industry comprises establishments of health practitioners having the degree of M.D. (Doctor of Medicine) or D.O. (Doctor of Osteopathic Medicine) primarily engaged in the independent practice of general or specialized medicine (e.g., anesthesiology, oncology, ophthalmology, psychiatry) or surgery. These practitioners operate private or group practices in their own offices (e.g., centers, clinics) or in the facilities of others, such as hospitals or HMO medical centers.