Specialized Freight Trucking
type: Class
subclass of: RBvXYVuffq7XXEmGpCJ0vCx
definition: This industry group comprises establishments primarily engaged in providing local or long-distance specialized freight trucking. The establishments of this industry are primarily engaged in the transportation of freight which, because of size, weight, shape, or other inherent characteristics, requires specialized equipment, such as flatbeds, tankers, or refrigerated trailers. This industry includes the transportation of used household, institutional, and commercial furniture and equipment.