Rendering and Meat Byproduct Processing
type: Class
subclass of: i22tsqU-R5SH9nDskUhX8Q
definition: This U.S. industry comprises establishments primarily engaged in rendering animal fat, bones, and meat scraps.