Nursery and Tree Production
type: Class
subclass of: Do81p7GqTVSWefgMOcuJzw
definition: This U.S. industry comprises establishments primarily engaged in (1) growing nursery products, nursery stock, shrubbery, bulbs, fruit stock, sod, and so forth, under cover or in open fields and/or (2) growing short rotation woody trees with a growth and harvest cycle of 10 years or less for pulp or tree stock.