Technical and Trade Schools
type: Class
subclass of: RA124f9A291d9D934b2DA572
definition: This industry comprises establishments primarily engaged in offering vocational and technical training in a variety of technical subjects and trades. The training often leads to job-specific certification. Instruction may be provided in diverse settings, such as the establishment's or client's training facilities, educational institutions, the workplace, or the home, and through diverse means, such as correspondence, television, the Internet, or other electronic and distance-learning methods. The training provided by these establishments may include the use of simulators and simulation methods.
example: Apprenticeship training programs
example: Aviation and flight training schools
example: Computer repair training
example: Cosmetology schools
example: Electronic equipment repair training
example: Graphic arts schools
example: Modeling schools
example: Nursing schools (except academic)
example: Real estate schools
example: Truck driving schools