Rice Milling
type: Class
subclass of: oS3ZjajvSPWy2t8a-D2yAQ
definition: This U.S. industry comprises establishments primarily engaged in one of the following: (1) milling rice; (2) cleaning and polishing rice; or (3) milling, cleaning, and polishing rice. The establishments in this industry may package the rice they mill with other ingredients.