Computer Facilities Management Services
type: Class
subclass of: wBpX5rAKRBenq8OgtEByNg
definition: This U.S. industry comprises establishments primarily engaged in providing on-site management and operation of clients' computer systems and/or data processing facilities. Establishments providing computer systems or data processing facilities support services are included in this industry.