Credit Bureaus
type: Class
subclass of: G2uOwH 7R0CdjDFVChy95Q
definition: This industry comprises establishments primarily engaged in compiling information, such as credit and employment histories, and providing the information to financial institutions, retailers, and others who have a need to evaluate the creditworthiness of individuals and businesses.