Other Fabricated Metal Product Manufacturing
type: Class
subclass of: Ebi1FLjOSRqXDvrM65TO6A
definition: This industry group comprises establishments primarily engaged in manufacturing fabricated metal products (except forgings and stampings, cutlery and handtools, architectural and structural metals, boilers, tanks, shipping containers, hardware, spring and wire products, machine shop products, turned products, screws, and nuts and bolts).