Tobacco Manufacturing
type: Class
subclass of: gVHpCi8RTNibiMbep1faAA
definition: This industry comprises establishments primarily engaged in (1) stemming and redrying tobacco and/or (2) manufacturing cigarettes or other tobacco products.
example: Chewing tobacco manufacturing
example: Cigar manufacturing
example: Cigarettes manufacturing (except electronic)
example: Prepared pipe tobacco manufacturing
example: Snuff manufacturing
example: Tobacco leaf processing and aging