Private Mail Centers
type: Class
subclass of: 6emZ3X6XRJ61lff nXHYDw
definition: This U.S. industry comprises (1) establishments primarily engaged in providing mailbox rental and other postal and mailing (except direct mail advertising) services or (2) establishments engaged in providing these mailing services along with one or more other office support services, such as facsimile services, word processing services, on-site PC rental services, and office product sales.