Nursery and Floriculture Production
type: Class
subclass of: vVPTZWM9TquOobPy0Y44pg
definition: This industry comprises establishments primarily engaged in (1) growing nursery and floriculture products (e.g., nursery stock, shrubbery, cut flowers, flower seeds, foliage plants) under cover or in open fields and/or (2) growing short rotation woody trees with a growing and harvesting cycle of 10 years or less for pulp or tree stock (e.g., cut Christmas trees, cottonwoods).