Other Aircraft Parts and Auxiliary Equipment Manufacturing
type: Class
subclass of: OHRgpwVGRR2OOs9XZgkEgA
definition: This U.S. industry comprises establishments primarily engaged in (1) manufacturing aircraft parts or auxiliary equipment (except engines and aircraft fluid power subassemblies) and/or (2) developing and making prototypes of aircraft parts and auxiliary equipment. Auxiliary equipment includes such items as crop dusting apparatus, armament racks, inflight refueling equipment, and external fuel tanks.