Automotive Parts and Accessories Retailers
type: Class
subclass of: TocdB2j8RJCD-Zq nA0hcA
definition: This industry comprises establishments primarily engaged in retailing new, used, and/or rebuilt automotive parts and accessories, with or without repairing automobiles; and/or establishments primarily engaged in retailing and installing automotive accessories.
example: Automotive parts and supply retailers
example: Automotive stereo retailers
example: Truck cap retailers
example: Used automotive parts retailers