New Housing For-Sale Builders
type: Class
subclass of: KBAKm1z2QOup3Md1jHUl-w
definition: This U.S. industry comprises establishments primarily engaged in building new homes on land that is owned or controlled by the builder rather than the homebuyer or investor. The land is included with the sale of the home. Establishments in this industry build single-family and/or multifamily homes. These establishments are often referred to as merchant builders, but are also known as production or for-sale builders.