Political Organizations
type: Class
subclass of: oArODBh5QiC5AC-yJoVSqg
definition: This industry comprises establishments primarily engaged in promoting the interests of national, state, or local political parties or candidates. Included are political groups organized to raise funds for a political party or individual candidates.
example: Campaign organizations, political
example: Political action committees (PACs)
example: Political campaign organizations
example: Political organizations or clubs
example: Political parties