Radio Broadcasting Stations
type: Class
subclass of: B01S6KdyTYqg4DnfBk2oXg
definition: This industry comprises establishments primarily engaged in broadcasting aural programs by radio to the public. These establishments operate radio broadcasting studios and facilities for the programming and transmission of programs to the public. Programming may originate in their own studio, from an affiliated network, or from external sources.