Inland Water Transportation
type: Class
subclass of: dm8ZD-7dSHukAG-aEBfZig
definition: This industry comprises establishments primarily engaged in providing inland water transportation of passengers and/or cargo on lakes, rivers, or intracoastal waterways (except on the Great Lakes System).