Lessors of Nonresidential Buildings (except Miniwarehouses)
type: Class
subclass of: eB4EsMp0QFGYJEKsqAox6g
definition: This industry comprises establishments primarily engaged in acting as lessors of buildings (except miniwarehouses and self-storage units) that are not used as residences or dwellings. Included in this industry are: (1) owner-lessors of nonresidential buildings; (2) establishments renting real estate and then acting as lessors in subleasing it to others; and (3) establishments providing full service office space, whether on a lease or service contract basis. The establishments in this industry may manage the property themselves or have another establishment manage it for them.