Poultry Processing
type: Class
subclass of: i22tsqU-R5SH9nDskUhX8Q
definition: This U.S. industry comprises establishments primarily engaged in (1) slaughtering poultry and small game and/or (2) preparing processed poultry and small game meat and meat byproducts.