Tobacco, Electronic Cigarette, and Other Smoking Supplies Retailers
type: Class
subclass of: 2Oxye5SjQYyEy3BmoxJcfQ
definition: This U.S. industry comprises establishments primarily engaged in retailing cigarettes, electronic cigarettes, cigars, tobacco, pipes, and other smokers' supplies.
example: Cigar retailers
example: Cigarette retailers
example: E-cigarette retailers
example: Smokers' supply retailers
example: Tobacco retailers
example: Vape shops