Other Plastics Product Manufacturing
type: Class
subclass of: P2ahRVjlQwyn4knwwoIQvw
definition: This industry comprises establishments primarily engaged in manufacturing plastics plumbing fixtures and other plastics products (except film, sheet, bags, profile shapes, pipes, pipe fittings, laminates, foam products, bottles, and hoses).
example: Inflatable plastics swimming pool rafts and similar flotation devices manufacturing
example: Plastics air mattresses manufacturing
example: Plastics bottle caps and lids manufacturing
example: Plastics bowls and bowl covers manufacturing
example: Plastics clothes hangers manufacturing
example: Plastics cups (except foam) manufacturing
example: Plastics dinnerware (except foam) manufacturing
example: Plastics gloves manufacturing
example: Plastics hardware manufacturing
example: Plastics ice chests or coolers (except plastics foam) manufacturing
example: Plastics or fiberglass plumbing fixtures (e.g., toilets, shower stalls, urinals) manufacturing
example: Plastics prefabricated buildings manufacturing
example: Plastics siding manufacturing
example: Plastics trash containers manufacturing
example: Resilient floor coverings (e.g., sheet, tiles) manufacturing