Relay and Industrial Control Manufacturing
type: Class
subclass of: 4iufljqCQa60MT3qIwSssA
definition: This U.S. industry comprises establishments primarily engaged in manufacturing relays, motor starters and controllers, and other industrial controls and control accessories.