Tobacco Product and Electronic Cigarette Merchant Wholesalers
type: Class
subclass of: x4 -bJB3TzmuIGNEuuB7lg
definition: This industry comprises establishments primarily engaged in the merchant wholesale distribution of tobacco products, such as cigarettes, snuff, cigars, pipe tobacco, and electronic cigarettes (including related parts and accessories).