Overhead Traveling Crane, Hoist, and Monorail System Manufacturing
type: Class
subclass of: HNVzadjSQGur0qgpX0Smbw
definition: This U.S. industry comprises establishments primarily engaged in manufacturing overhead traveling cranes, hoists, and monorail systems.
example: Aerial work platforms manufacturing
example: Automobile wrecker (i.e., tow truck) hoists manufacturing
example: Block and tackle manufacturing
example: Metal pulleys (except power transmission) manufacturing
example: Winches manufacturing