Aquaculture
type: Class
subclass of: 5uTZQJ54RrS09SwZ9yZCOA
definition: This industry comprises establishments primarily engaged in the farm raising and production of aquatic animals or plants in controlled or selected aquatic environments. These establishments use some form of intervention in the rearing process to enhance production, such as holding in captivity, regular stocking, feeding, and protecting from predators, pests, and disease.