Inland Water Passenger Transportation
type: Class
subclass of: FU1iai9aRCiAxRE3W8mGEQ
definition: This U.S. industry comprises establishments primarily engaged in providing inland water transportation of passengers on lakes, rivers, or intracoastal waterways (except on the Great Lakes System).