Document Preparation Services
type: Class
subclass of: yFs1pkk7QF6m3nfn1CBCRw
definition: This industry comprises establishments primarily engaged in one or more of the following: (1) letter or resume writing; (2) document editing or proofreading; (3) typing, word processing, or desktop publishing; and (4) stenography (except court reporting or stenotype recording), transcription, and other secretarial services.