Oilseed and Grain Combination Farming
type: Class
subclass of: rFxiFFIgR0e-HtHVgb0d9Q
definition: This U.S. industry comprises establishments engaged in growing a combination of oilseed(s) and grain(s) with no one oilseed (or family of oilseeds) or grain (or family of grains) accounting for one-half of the establishment's agricultural production (value of crops for market). These establishments may produce oilseed(s) and grain(s) seeds and/or grow oilseed(s) and grain(s).