All Other Nonmetallic Mineral Product Manufacturing
type: Class
subclass of: FQRPl0mWQw6wcgApCjO-iA
definition: This industry comprises establishments primarily engaged in manufacturing nonmetallic mineral products (except pottery and plumbing fixtures; clay building materials and refractories; glass and glass products; cement; ready-mix concrete; concrete products; lime; gypsum products; and abrasive products).