Nonferrous Metal (except Aluminum) Smelting and Refining
type: Class
subclass of: JI7GK6c7Q-uDS3y59ggWhg
definition: This industry comprises establishments primarily engaged in (1) smelting ores into nonferrous metals and/or (2) the primary refining of nonferrous metals (except aluminum) by electrolytic methods or other processes.