Other Motor Vehicle Parts Manufacturing
type: Class
subclass of: i7wA9uxqSMe5n4kDBS4jIA
definition: This industry comprises establishments primarily engaged in manufacturing and/or rebuilding motor vehicle parts and accessories (except motor vehicle gasoline engines and engine parts, motor vehicle electrical and electronic equipment, motor vehicle steering and suspension components, motor vehicle brake systems, motor vehicle transmissions and power train parts, motor vehicle seating and interior trim, and motor vehicle stampings).
example: Air bag assemblies manufacturing
example: Air filters, automotive, truck, and bus, manufacturing
example: Air-conditioners, motor vehicle, manufacturing
example: Catalytic converters, engine exhaust, automotive, truck, and bus, manufacturing
example: Compressors, motor vehicle air-conditioning, manufacturing
example: Mufflers and resonators, motor vehicle, manufacturing
example: Radiators and cores manufacturing
example: Wheels (i.e., rims), automotive, truck, and bus, manufacturing